Target
Protein RecA
Ligand
BDBM36853
Substrate
Meas. Tech.
Fluorescence Cell-Free Homogeneous Counter Screen to Identify Inhibitors of GFP Chromophore Formation
EC50
52150±n/a nM
Citation
 PubChem, PC Fluorescence Cell-Free Homogeneous Counter Screen to Identify Inhibitors of GFP Chromophore Formation PubChem Bioassay (2010)[AID] 
Target
Name:
Protein RecA
Synonyms:
DNA recombination protein RecA recA
Type:
Enzyme Catalytic Domain
Mol. Mass.:
85386.52
Organism:
Mycobacterium tuberculosis H37Rv
Description:
gi_15609874
Residue:
790
  
Inhibitor
Name:
BDBM36853
Synonyms:
MLS000034488 N-tert-butyl-2-[3-[(2-chlorophenyl)methyl]triazolo[4,5-d]pyrimidin-7-yl]sulfanylacetamide N-tert-butyl-2-[[3-[(2-chlorophenyl)methyl]-7-triazolo[4,5-d]pyrimidinyl]thio]acetamide SMR000000867 | cid_650829
Type:
Small organic molecule
Emp. Form.:
C17H19ClN6OS
Mol. Mass.:
390.89
SMILES:
CC(C)(C)NC(=O)CSc1ncnc2n(Cc3ccccc3Cl)nnc12
: