Target
Protein RecA
Ligand
BDBM34351
Substrate
Meas. Tech.
Fluorescence Cell-Free Homogeneous Counter Screen to Identify Inhibitors of GFP Chromophore Formation
EC50
89820±n/a nM
Citation
 PubChem, PC Fluorescence Cell-Free Homogeneous Counter Screen to Identify Inhibitors of GFP Chromophore Formation PubChem Bioassay (2010)[AID] 
Target
Name:
Protein RecA
Synonyms:
DNA recombination protein RecA recA
Type:
Enzyme Catalytic Domain
Mol. Mass.:
85386.52
Organism:
Mycobacterium tuberculosis H37Rv
Description:
gi_15609874
Residue:
790
  
Inhibitor
Name:
BDBM34351
Synonyms:
2-[3-(4-fluorophenyl)triazolo[4,5-d]pyrimidin-7-yl]sulfanyl-N,N-dimethyl-3-oxobutanamide 2-[[3-(4-fluorophenyl)-[1,2,3]triazolo[4,5-d]pyrimidin-7-yl]sulfanyl]-N,N-dimethyl-3-oxidanylidene-butanamide 2-{[3-(4-fluorophenyl)-3H-[1,2,3]triazolo[4,5-d]pyrimidin-7-yl]thio}-N,N-dimethyl-3-oxobutanamide SMR000029671 | cid_3236117
Type:
Small organic molecule
Emp. Form.:
C16H15FN6O2S
Mol. Mass.:
374.393
SMILES:
CN(C)C(=O)C(Sc1ncnc2n(nnc12)-c1ccc(F)cc1)C(C)=O
: