Target
Amyloid-beta A4 precursor protein-binding family A member 1
Ligand
BDBM65792
Substrate
Meas. Tech.
SAR analysis of small molecule inhibitors of Mint-PDZ and N-type Ca2+ channel carboxyl-terminal peptide association using HTRF - Set 2
IC50
>56800±n/a nM
Citation
 PubChem, PC SAR analysis of small molecule inhibitors of Mint-PDZ and N-type Ca2+ channel carboxyl-terminal peptide association using HTRF - Set 2 PubChem Bioassay (2010)[AID] 
Target
Name:
Amyloid-beta A4 precursor protein-binding family A member 1
Synonyms:
APBA1_RAT Mint1 neuronal munc18-1 binding protein
Type:
Enzyme Catalytic Domain
Mol. Mass.:
92603.32
Organism:
Rattus norvegicus
Description:
gi_2625023
Residue:
839
  
Inhibitor
Name:
BDBM65792
Synonyms:
2-(2-furanyl)-N-(2-pyridin-4-ylethyl)-4-quinolinecarboxamide;2,2,2-trifluoroacetic acid 2-(furan-2-yl)-N-(2-pyridin-4-ylethyl)quinoline-4-carboxamide;2,2,2-trifluoroacetic acid VU0409718-1 | cid_44602308
Type:
Small organic molecule
Emp. Form.:
C21H17N3O2
Mol. Mass.:
343.3786
SMILES:
O=C(NCCc1ccncc1)c1cc(nc2ccccc12)-c1ccco1
: