Target
Heat shock factor protein 1
Ligand
BDBM50262140
Substrate
Meas. Tech.
Luminescence Cell-Based Dose Retest to Identify Potentiators of Heat Shock Factor 1 (HSF1)
EC50
4071±n/a nM
Citation
 PubChem, PC Luminescence Cell-Based Dose Retest to Identify Potentiators of Heat Shock Factor 1 (HSF1) PubChem Bioassay (2010)[AID] 
Target
Name:
Heat shock factor protein 1
Synonyms:
HSF1_MOUSE Hsf1 protein
Type:
Enzyme Catalytic Domain
Mol. Mass.:
57208.68
Organism:
Mus musculus
Description:
P38532
Residue:
525
  
Inhibitor
Name:
BDBM50262140
Synonyms:
(17beta)-estra-1,3,5(10)-triene-2,3,17-triol 2-OH-estradiol CHEMBL467987 cid_247304 | estra-1,3,5(10)-triene-2,3,17beta-triol
Type:
Small organic molecule
Emp. Form.:
C18H24O3
Mol. Mass.:
288.3814
SMILES:
C[C@]12CC[C@H]3[C@@H](CCc4cc(O)c(O)cc34)[C@@H]1CC[C@@H]2O
: