Target
Heat shock factor protein 1
Ligand
BDBM71924
Substrate
Meas. Tech.
Luminescence Cell-Based Dose Retest to Identify Potentiators of Heat Shock Factor 1 (HSF1)
EC50
>260000±n/a nM
Citation
 PubChem, PC Luminescence Cell-Based Dose Retest to Identify Potentiators of Heat Shock Factor 1 (HSF1) PubChem Bioassay (2010)[AID] 
Target
Name:
Heat shock factor protein 1
Synonyms:
HSF1_MOUSE Hsf1 protein
Type:
Enzyme Catalytic Domain
Mol. Mass.:
57208.68
Organism:
Mus musculus
Description:
P38532
Residue:
525
  
Inhibitor
Name:
BDBM71924
Synonyms:
2-phenyl-4-(phenylsulfanyl)-6-[(phenylsulfinyl)methyl]pyrimidine 4-(benzenesulfinylmethyl)-2-phenyl-6-(phenylthio)pyrimidine MLS000540329 cid_2769224
Type:
Small organic molecule
Emp. Form.:
C23H18N2OS2
Mol. Mass.:
402.532
SMILES:
O=S(Cc1cc(Sc2ccccc2)nc(n1)-c1ccccc1)c1ccccc1
: