Target
Protein RecA
Ligand
BDBM70257
Substrate
Meas. Tech.
Fluorescence Cell-Free Homogeneous Dose Retest to Identify Inhibitors of RecA-Intein Splicing Activity
EC50
6490±n/a nM
Citation
 PubChem, PC Fluorescence Cell-Free Homogeneous Dose Retest to Identify Inhibitors of RecA-Intein Splicing Activity PubChem Bioassay (2010)[AID] 
Target
Name:
Protein RecA
Synonyms:
DNA recombination protein RecA recA
Type:
Enzyme Catalytic Domain
Mol. Mass.:
85386.52
Organism:
Mycobacterium tuberculosis H37Rv
Description:
gi_15609874
Residue:
790
  
Inhibitor
Name:
BDBM70257
Synonyms:
6-Amino-4-(2-fluoro-phenyl)-3-methoxymethyl-1,4-dihydro-pyrano[2,3-c]pyrazole-5-carbonitrile 6-azanyl-4-(2-fluorophenyl)-3-(methoxymethyl)-2,4-dihydropyrano[2,3-c]pyrazole-5-carbonitrile SMR000014556 | cid_648896
Type:
Small organic molecule
Emp. Form.:
C15H13FN4O2
Mol. Mass.:
300.2877
SMILES:
COCc1n[nH]c2OC(=N)C(C#N)C(c12)c1ccccc1F
: