Target
Protein RecA
Ligand
BDBM31054
Substrate
Meas. Tech.
Fluorescence Cell-Free Homogeneous Dose Retest to Identify Inhibitors of RecA-Intein Splicing Activity
EC50
3740±n/a nM
Citation
 PubChem, PC Fluorescence Cell-Free Homogeneous Dose Retest to Identify Inhibitors of RecA-Intein Splicing Activity PubChem Bioassay (2010)[AID] 
Target
Name:
Protein RecA
Synonyms:
DNA recombination protein RecA recA
Type:
Enzyme Catalytic Domain
Mol. Mass.:
85386.52
Organism:
Mycobacterium tuberculosis H37Rv
Description:
gi_15609874
Residue:
790
  
Inhibitor
Name:
BDBM31054
Synonyms:
(2E)-3,3,3-trifluoro-2-(4-keto-6-methyl-[1,3]oxathiolo[4,5-c]pyran-2-ylidene)propionic acid methyl ester MLS000078159 cid_660939 methyl (2E)-3,3,3-tris(fluoranyl)-2-(6-methyl-4-oxidanylidene-[1,3]oxathiolo[4,5-c]pyran-2-ylidene)propanoate
Type:
Small organic molecule
Emp. Form.:
C11H7F3O5S
Mol. Mass.:
308.23
SMILES:
COC(=O)C(=C1\Oc2cc(C)oc(=O)c2S1)\C(F)(F)F
: