Target
Protein RecA
Ligand
BDBM70339
Substrate
Meas. Tech.
Fluorescence Cell-Free Homogeneous Dose Retest to Identify Inhibitors of RecA-Intein Splicing Activity
EC50
17300±n/a nM
Citation
 PubChem, PC Fluorescence Cell-Free Homogeneous Dose Retest to Identify Inhibitors of RecA-Intein Splicing Activity PubChem Bioassay (2010)[AID] 
Target
Name:
Protein RecA
Synonyms:
DNA recombination protein RecA recA
Type:
Enzyme Catalytic Domain
Mol. Mass.:
85386.52
Organism:
Mycobacterium tuberculosis H37Rv
Description:
gi_15609874
Residue:
790
  
Inhibitor
Name:
BDBM70339
Synonyms:
2,6-ditert-butyl-4-[[4-(2-hydroxyethyl)-1-piperazinyl]-(3-pyridinyl)methyl]phenol 2,6-ditert-butyl-4-[[4-(2-hydroxyethyl)piperazin-1-yl]-pyridin-3-ylmethyl]phenol MLS000054481 cid_2998271
Type:
Small organic molecule
Emp. Form.:
C26H39N3O2
Mol. Mass.:
425.6068
SMILES:
CC(C)(C)c1cc(cc(c1O)C(C)(C)C)C(N1CCN(CCO)CC1)c1cccnc1
: