Target
Eukaryotic translation initiation factor 4H
Ligand
BDBM73152
Substrate
Meas. Tech.
SAR analysis for the identification of translation initiation inhibitors (eIF4H)
IC50
>100000±n/a nM
Citation
 PubChem, PC SAR analysis for the identification of translation initiation inhibitors (eIF4H) PubChem Bioassay (2010)[AID] 
Target
Name:
Eukaryotic translation initiation factor 4H
Synonyms:
EIF4H KIAA0038 WSCR1
Type:
Enzyme Catalytic Domain
Mol. Mass.:
27385.24
Organism:
Homo sapiens (Human)
Description:
Q15056
Residue:
248
  
Inhibitor
Name:
BDBM73152
Synonyms:
4-(methoxymethyl)benzoic acid [2-(2-methoxy-4-nitroanilino)-2-oxoethyl] ester MLS-0435519.0001 [2-[(2-methoxy-4-nitro-phenyl)amino]-2-oxidanylidene-ethyl] 4-(methoxymethyl)benzoate | cid_7488993
Type:
Small organic molecule
Emp. Form.:
C18H18N2O7
Mol. Mass.:
374.3447
SMILES:
COCc1ccc(cc1)C(=O)OCC(=O)Nc1ccc(cc1OC)[N+]([O-])=O
: