Target
Eukaryotic translation initiation factor 4H
Ligand
BDBM73167
Substrate
Meas. Tech.
SAR analysis for the identification of translation initiation inhibitors (eIF4H)
IC50
>100000±n/a nM
Citation
 PubChem, PC SAR analysis for the identification of translation initiation inhibitors (eIF4H) PubChem Bioassay (2010)[AID] 
Target
Name:
Eukaryotic translation initiation factor 4H
Synonyms:
EIF4H KIAA0038 WSCR1
Type:
Enzyme Catalytic Domain
Mol. Mass.:
27385.24
Organism:
Homo sapiens (Human)
Description:
Q15056
Residue:
248
  
Inhibitor
Name:
BDBM73167
Synonyms:
MLS-0435552.0001 N-(4-chloro-2-methyl-phenyl)-1-(2-thenoyl)isonipecotamide N-(4-chloro-2-methylphenyl)-1-[oxo(thiophen-2-yl)methyl]-4-piperidinecarboxamide | cid_1075438
Type:
Small organic molecule
Emp. Form.:
C18H19ClN2O2S
Mol. Mass.:
362.874
SMILES:
Cc1cc(Cl)ccc1NC(=O)C1CCN(CC1)C(=O)c1cccs1
: