Target
Eukaryotic translation initiation factor 4H
Ligand
BDBM61236
Substrate
Meas. Tech.
SAR analysis for the identification of translation initiation inhibitors (eIF4H)
IC50
2410±n/a nM
Citation
 PubChem, PC SAR analysis for the identification of translation initiation inhibitors (eIF4H) PubChem Bioassay (2010)[AID] 
Target
Name:
Eukaryotic translation initiation factor 4H
Synonyms:
EIF4H KIAA0038 WSCR1
Type:
Enzyme Catalytic Domain
Mol. Mass.:
27385.24
Organism:
Homo sapiens (Human)
Description:
Q15056
Residue:
248
  
Inhibitor
Name:
BDBM61236
Synonyms:
2-{4-[(2-Hydroxy-benzoyl)-hydrazonomethyl]-2-methoxy-phenoxy}-N-phenyl-acetamide N-[[3-methoxy-4-(2-oxidanylidene-2-phenylazanyl-ethoxy)phenyl]methylideneamino]-2-oxidanyl-benzamide N-[[4-(2-anilino-2-oxoethoxy)-3-methoxyphenyl]methylideneamino]-2-hydroxybenzamide cid_1105530
Type:
Small organic molecule
Emp. Form.:
C23H21N3O5
Mol. Mass.:
419.4299
SMILES:
COc1cc(C=NNC(=O)c2ccccc2O)ccc1OCC(=O)Nc1ccccc1
: