Target
Eukaryotic translation initiation factor 4H
Ligand
BDBM73174
Substrate
Meas. Tech.
SAR analysis for the identification of translation initiation inhibitors (eIF4H)
IC50
80800±n/a nM
Citation
 PubChem, PC SAR analysis for the identification of translation initiation inhibitors (eIF4H) PubChem Bioassay (2010)[AID] 
Target
Name:
Eukaryotic translation initiation factor 4H
Synonyms:
EIF4H KIAA0038 WSCR1
Type:
Enzyme Catalytic Domain
Mol. Mass.:
27385.24
Organism:
Homo sapiens (Human)
Description:
Q15056
Residue:
248
  
Inhibitor
Name:
BDBM73174
Synonyms:
4-[[3-ethyl-2-(2-methoxyphenyl)imino-4-oxidanylidene-1,3-thiazinan-6-yl]carbonylamino]benzoic acid 4-[[3-ethyl-4-keto-2-(2-methoxyphenyl)imino-1,3-thiazinane-6-carbonyl]amino]benzoic acid MLS-0030601.0001 | cid_653399
Type:
Small organic molecule
Emp. Form.:
C21H21N3O5S
Mol. Mass.:
427.474
SMILES:
CCN1C(=O)CC(S\C1=N/c1ccccc1OC)C(=O)Nc1ccc(cc1)C(O)=O
: