Target
Polyadenylate-binding protein 1
Ligand
BDBM73164
Substrate
Meas. Tech.
SAR analysis for the identification of translation initiation inhibitors (PABP)
IC50
>100000±n/a nM
Citation
 PubChem, PC SAR analysis for the identification of translation initiation inhibitors (PABP) PubChem Bioassay (2010)[AID] 
Target
Name:
Polyadenylate-binding protein 1
Synonyms:
PAB1 PABP1 PABPC1 poly(A) binding protein, cytoplasmic 1 | polyadenylate-binding protein 1
Type:
Enzyme Catalytic Domain
Mol. Mass.:
70694.26
Organism:
Homo sapiens (Human)
Description:
gi_46367787
Residue:
636
  
Inhibitor
Name:
BDBM73164
Synonyms:
MLS-0435549.0001 N-(2-methylphenyl)-1-[oxo(thiophen-2-yl)methyl]-4-piperidinecarboxamide N-(o-tolyl)-1-(2-thenoyl)isonipecotamide | cid_1075486
Type:
Small organic molecule
Emp. Form.:
C18H20N2O2S
Mol. Mass.:
328.429
SMILES:
Cc1ccccc1NC(=O)C1CCN(CC1)C(=O)c1cccs1
: