Target
Polyadenylate-binding protein 1
Ligand
BDBM50995
Substrate
Meas. Tech.
SAR analysis for the identification of translation initiation inhibitors (PABP)
IC50
>100000±n/a nM
Citation
 PubChem, PC SAR analysis for the identification of translation initiation inhibitors (PABP) PubChem Bioassay (2010)[AID] 
Target
Name:
Polyadenylate-binding protein 1
Synonyms:
PAB1 PABP1 PABPC1 poly(A) binding protein, cytoplasmic 1 | polyadenylate-binding protein 1
Type:
Enzyme Catalytic Domain
Mol. Mass.:
70694.26
Organism:
Homo sapiens (Human)
Description:
gi_46367787
Residue:
636
  
Inhibitor
Name:
BDBM50995
Synonyms:
2-{4-[(4-Hydroxy-benzoyl)-hydrazonomethyl]-phenoxy}-N-(4-nitro-phenyl)-acetamide 4-hydroxy-N-[[4-[2-keto-2-(4-nitroanilino)ethoxy]benzylidene]amino]benzamide N-[[4-[2-[(4-nitrophenyl)amino]-2-oxidanylidene-ethoxy]phenyl]methylideneamino]-4-oxidanyl-benzamide cid_3115893
Type:
Small organic molecule
Emp. Form.:
C22H18N4O6
Mol. Mass.:
434.4015
SMILES:
Oc1ccc(cc1)C(=O)NN=Cc1ccc(OCC(=O)Nc2ccc(cc2)[N+]([O-])=O)cc1
: