Target
Polyadenylate-binding protein 1
Ligand
BDBM73179
Substrate
Meas. Tech.
SAR analysis for the identification of translation initiation inhibitors (PABP)
IC50
>100000±n/a nM
Citation
 PubChem, PC SAR analysis for the identification of translation initiation inhibitors (PABP) PubChem Bioassay (2010)[AID] 
Target
Name:
Polyadenylate-binding protein 1
Synonyms:
PAB1 PABP1 PABPC1 poly(A) binding protein, cytoplasmic 1 | polyadenylate-binding protein 1
Type:
Enzyme Catalytic Domain
Mol. Mass.:
70694.26
Organism:
Homo sapiens (Human)
Description:
gi_46367787
Residue:
636
  
Inhibitor
Name:
BDBM73179
Synonyms:
MLS-0356838.0001 N-(2,5-dimethylphenyl)-1-(thiophene-2-carbonyl)piperidine-4-carboxamide N-(2,5-dimethylphenyl)-1-thiophen-2-ylcarbonyl-piperidine-4-carboxamide | cid_778148
Type:
Small organic molecule
Emp. Form.:
C19H22N2O2S
Mol. Mass.:
342.455
SMILES:
Cc1ccc(C)c(NC(=O)C2CCN(CC2)C(=O)c2cccs2)c1
: