Target
Polyadenylate-binding protein 1
Ligand
BDBM61383
Substrate
Meas. Tech.
SAR analysis for the identification of translation initiation inhibitors (PABP)
IC50
13800±n/a nM
Citation
 PubChem, PC SAR analysis for the identification of translation initiation inhibitors (PABP) PubChem Bioassay (2010)[AID] 
Target
Name:
Polyadenylate-binding protein 1
Synonyms:
PAB1 PABP1 PABPC1 poly(A) binding protein, cytoplasmic 1 | polyadenylate-binding protein 1
Type:
Enzyme Catalytic Domain
Mol. Mass.:
70694.26
Organism:
Homo sapiens (Human)
Description:
gi_46367787
Residue:
636
  
Inhibitor
Name:
BDBM61383
Synonyms:
1-methyl-3-(phenylthio)-2-indolecarboxylic acid methyl ester MLS001199068 cid_20888286 methyl 1-methyl-3-phenylsulfanyl-indole-2-carboxylate | methyl 1-methyl-3-phenylsulfanylindole-2-carboxylate
Type:
Small organic molecule
Emp. Form.:
C17H15NO2S
Mol. Mass.:
297.371
SMILES:
COC(=O)c1c(Sc2ccccc2)c2ccccc2n1C
: