Target
Polyadenylate-binding protein 1
Ligand
BDBM73194
Substrate
Meas. Tech.
SAR analysis for the identification of translation initiation inhibitors (PABP)
IC50
>100000±n/a nM
Citation
 PubChem, PC SAR analysis for the identification of translation initiation inhibitors (PABP) PubChem Bioassay (2010)[AID] 
Target
Name:
Polyadenylate-binding protein 1
Synonyms:
PAB1 PABP1 PABPC1 poly(A) binding protein, cytoplasmic 1 | polyadenylate-binding protein 1
Type:
Enzyme Catalytic Domain
Mol. Mass.:
70694.26
Organism:
Homo sapiens (Human)
Description:
gi_46367787
Residue:
636
  
Inhibitor
Name:
BDBM73194
Synonyms:
2-[6-(furan-2-yl)pyridazin-3-yl]sulfanyl-N-[2-(2-methoxyphenyl)ethyl]acetamide 2-[[6-(2-furanyl)-3-pyridazinyl]thio]-N-[2-(2-methoxyphenyl)ethyl]acetamide MLS-0241469.0001 | cid_6624223
Type:
Small organic molecule
Emp. Form.:
C19H19N3O3S
Mol. Mass.:
369.437
SMILES:
COc1ccccc1CCNC(=O)CSc1ccc(nn1)-c1ccco1
: