Target
Polyadenylate-binding protein 1
Ligand
BDBM73200
Substrate
Meas. Tech.
SAR analysis for the identification of translation initiation inhibitors (PABP)
IC50
>100000±n/a nM
Citation
 PubChem, PC SAR analysis for the identification of translation initiation inhibitors (PABP) PubChem Bioassay (2010)[AID] 
Target
Name:
Polyadenylate-binding protein 1
Synonyms:
PAB1 PABP1 PABPC1 poly(A) binding protein, cytoplasmic 1 | polyadenylate-binding protein 1
Type:
Enzyme Catalytic Domain
Mol. Mass.:
70694.26
Organism:
Homo sapiens (Human)
Description:
gi_46367787
Residue:
636
  
Inhibitor
Name:
BDBM73200
Synonyms:
MLS-0435567.0001 N-[(Z)-[4-[2-(3,4-dimethylanilino)-2-oxoethoxy]-3-methoxyphenyl]methylideneamino]-4-methoxybenzamide cid_5434131
Type:
Small organic molecule
Emp. Form.:
C26H27N3O5
Mol. Mass.:
461.5097
SMILES:
COc1ccc(cc1)C(=O)N\N=C/c1ccc(OCC(=O)Nc2ccc(C)c(C)c2)c(OC)c1
: