Target
Protein LANA1
Ligand
BDBM73289
Substrate
Meas. Tech.
Fluorescence Polarization Cell-Free Homogeneous Dose Retest to Confirm Inhibitors of the LANA Histone H2A/H2B Interaction
EC50
>75000±n/a nM
Citation
 PubChem, PC Fluorescence Polarization Cell-Free Homogeneous Dose Retest to Confirm Inhibitors of the LANA Histone H2A/H2B Interaction PubChem Bioassay (2010)[AID] 
Target
Name:
Protein LANA1
Synonyms:
LANA LANA1_HHV8P
Type:
Enzyme Catalytic Domain
Mol. Mass.:
131093.36
Organism:
Human herpesvirus 8
Description:
Q9QR71
Residue:
1129
  
Inhibitor
Name:
BDBM73289
Synonyms:
1-methyl-3-[(4-phenyl-1-piperazinyl)methyl]indole 1-methyl-3-[(4-phenylpiperazin-1-yl)methyl]indole MLS000045967 cid_3238236
Type:
Small organic molecule
Emp. Form.:
C20H23N3
Mol. Mass.:
305.4167
SMILES:
Cn1cc(CN2CCN(CC2)c2ccccc2)c2ccccc12
: