Target
Protein LANA1
Ligand
BDBM35431
Substrate
Meas. Tech.
Fluorescence Polarization Cell-Free Homogeneous Dose Retest to Confirm Inhibitors of the LANA Histone H2A/H2B Interaction
EC50
221.2±n/a nM
Citation
 PubChem, PC Fluorescence Polarization Cell-Free Homogeneous Dose Retest to Confirm Inhibitors of the LANA Histone H2A/H2B Interaction PubChem Bioassay (2010)[AID] 
Target
Name:
Protein LANA1
Synonyms:
LANA LANA1_HHV8P
Type:
Enzyme Catalytic Domain
Mol. Mass.:
131093.36
Organism:
Human herpesvirus 8
Description:
Q9QR71
Residue:
1129
  
Inhibitor
Name:
BDBM35431
Synonyms:
MLS000106874 cid_774975
Type:
Small organic molecule
Emp. Form.:
C15H9NO3
Mol. Mass.:
251.2369
SMILES:
COc1ccc2noc3-c4ccccc4C(=O)c1c23
: