Target
Tyrosine-protein phosphatase non-receptor type 22
Ligand
BDBM74450
Substrate
Meas. Tech.
Dose Response confirmation of uHTS hits from a small molecule inhibitors of LYP via a fluorescence intensity assay - Set 2
IC50
>79400±0 nM
Citation
 PubChem, PC Dose Response confirmation of uHTS hits from a small molecule inhibitors of LYP via a fluorescence intensity assay - Set 2 PubChem Bioassay (2010)[AID] 
Target
Name:
Tyrosine-protein phosphatase non-receptor type 22
Synonyms:
3.1.3.48 LyP Lymphoid phosphatase (Lyp) PEST-domain phosphatase PTPN22 Tyrosine-protein phosphatase non-receptor type 22 (LYP) | tyrosine-protein phosphatase non-receptor type 22 isoform 1
Type:
Mol. Mass.:
91712.31
Organism:
Homo sapiens (Human)
Description:
Q9Y2R2
Residue:
807
  
Inhibitor
Name:
BDBM74450
Synonyms:
3-[2-(2,3,5,6-tetrafluoro-4-methylol-anilino)ethylamino]cyclohex-2-en-1-one 3-[2-[2,3,5,6-tetrafluoro-4-(hydroxymethyl)anilino]ethylamino]cyclohex-2-en-1-one MLS000039349 cid_660485
Type:
Small organic molecule
Emp. Form.:
C15H16F4N2O2
Mol. Mass.:
332.2934
SMILES:
OCc1c(F)c(F)c(NCCNC2=CC(=O)CCC2)c(F)c1F
: