Target
Tyrosine-protein phosphatase non-receptor type 22
Ligand
BDBM74518
Substrate
Meas. Tech.
Dose Response confirmation of uHTS hits from a small molecule inhibitors of LYP via a fluorescence intensity assay - Set 2
IC50
>79400±0 nM
Citation
 PubChem, PC Dose Response confirmation of uHTS hits from a small molecule inhibitors of LYP via a fluorescence intensity assay - Set 2 PubChem Bioassay (2010)[AID] 
Target
Name:
Tyrosine-protein phosphatase non-receptor type 22
Synonyms:
3.1.3.48 LyP Lymphoid phosphatase (Lyp) PEST-domain phosphatase PTPN22 Tyrosine-protein phosphatase non-receptor type 22 (LYP) | tyrosine-protein phosphatase non-receptor type 22 isoform 1
Type:
Mol. Mass.:
91712.31
Organism:
Homo sapiens (Human)
Description:
Q9Y2R2
Residue:
807
  
Inhibitor
Name:
BDBM74518
Synonyms:
(6E)-4-bromanyl-2-nitro-6-[(1,2,4-triazol-4-ylamino)methylidene]cyclohexa-2,4-dien-1-one (6E)-4-bromo-2-nitro-6-[(1,2,4-triazol-4-ylamino)methylidene]-1-cyclohexa-2,4-dienone MLS000714804 cid_6537826
Type:
Small organic molecule
Emp. Form.:
C9H6BrN5O3
Mol. Mass.:
312.08
SMILES:
[O-][N+](=O)c1cc(Br)c[c-](\C=[NH+]\n2cnnc2)c1=O
: