Target
Tyrosine-protein phosphatase non-receptor type 22
Ligand
BDBM74523
Substrate
Meas. Tech.
Dose Response confirmation of uHTS hits from a small molecule inhibitors of LYP via a fluorescence intensity assay - Set 2
IC50
>79400±0 nM
Citation
 PubChem, PC Dose Response confirmation of uHTS hits from a small molecule inhibitors of LYP via a fluorescence intensity assay - Set 2 PubChem Bioassay (2010)[AID] 
Target
Name:
Tyrosine-protein phosphatase non-receptor type 22
Synonyms:
3.1.3.48 LyP Lymphoid phosphatase (Lyp) PEST-domain phosphatase PTPN22 Tyrosine-protein phosphatase non-receptor type 22 (LYP) | tyrosine-protein phosphatase non-receptor type 22 isoform 1
Type:
Mol. Mass.:
91712.31
Organism:
Homo sapiens (Human)
Description:
Q9Y2R2
Residue:
807
  
Inhibitor
Name:
BDBM74523
Synonyms:
3-[4-(2,5-dimethyl-1H-pyrrol-1-yl)phenyl]-1H-pyrazole 5-[4-(2,5-dimethylpyrrol-1-yl)phenyl]-1H-pyrazole SMR000336537 | cid_1474504
Type:
Small organic molecule
Emp. Form.:
C15H15N3
Mol. Mass.:
237.2997
SMILES:
Cc1ccc(C)n1-c1ccc(cc1)-c1cc[nH]n1
: