Target
Importin subunit alpha-1
Ligand
BDBM74590
Substrate
Meas. Tech.
Fluorescence Cell-Free Homogeneous Counterscreen to Identify Inhibitors of the RanGTP-Importin-beta complex.
EC50
14510±n/a nM
Citation
 PubChem, PC Fluorescence Cell-Free Homogeneous Counterscreen to Identify Inhibitors of the RanGTP-Importin-beta complex. PubChem Bioassay (2010)[AID] 
Target
Name:
Importin subunit alpha-1
Synonyms:
IMA1_HUMAN RCH1 karyopherin alpha 2 (RAG cohort 1, importin alpha 1), isoform CRA_b
Type:
Enzyme Catalytic Domain
Mol. Mass.:
57852.15
Organism:
Homo sapiens (Human)
Description:
gi_119609447
Residue:
529
  
Inhibitor
Name:
BDBM74590
Synonyms:
2-cyano-2-[3-(4-methyl-1-piperidinyl)-2-quinoxalinyl]acetic acid cyclohexyl ester MLS000040156 cid_663318 cyclohexyl 2-cyano-2-[3-(4-methylpiperidin-1-yl)quinoxalin-2-yl]ethanoate
Type:
Small organic molecule
Emp. Form.:
C23H28N4O2
Mol. Mass.:
392.494
SMILES:
CC1CCN(CC1)c1nc2ccccc2nc1C(C#N)C(=O)OC1CCCCC1
: