Target
Importin subunit alpha-1
Ligand
BDBM74610
Substrate
Meas. Tech.
Fluorescence Cell-Free Homogeneous Counterscreen to Identify Inhibitors of the RanGTP-Importin-beta complex.
EC50
>500000±n/a nM
Citation
 PubChem, PC Fluorescence Cell-Free Homogeneous Counterscreen to Identify Inhibitors of the RanGTP-Importin-beta complex. PubChem Bioassay (2010)[AID] 
Target
Name:
Importin subunit alpha-1
Synonyms:
IMA1_HUMAN RCH1 karyopherin alpha 2 (RAG cohort 1, importin alpha 1), isoform CRA_b
Type:
Enzyme Catalytic Domain
Mol. Mass.:
57852.15
Organism:
Homo sapiens (Human)
Description:
gi_119609447
Residue:
529
  
Inhibitor
Name:
BDBM74610
Synonyms:
2-(methylthio)-3-pyridinecarboxylic acid [2-(2-benzofuranyl)-2-oxoethyl] ester MLS000055370 [2-(1-benzofuran-2-yl)-2-oxidanylidene-ethyl] 2-methylsulfanylpyridine-3-carboxylate cid_2336404
Type:
Small organic molecule
Emp. Form.:
C17H13NO4S
Mol. Mass.:
327.354
SMILES:
CSc1ncccc1C(=O)OCC(=O)c1cc2ccccc2o1
: