Target
Importin subunit alpha-1
Ligand
BDBM74700
Substrate
Meas. Tech.
Fluorescence Cell-Free Homogeneous Counterscreen to Identify Inhibitors of the RanGTP-Importin-beta complex.
EC50
>500000±n/a nM
Citation
 PubChem, PC Fluorescence Cell-Free Homogeneous Counterscreen to Identify Inhibitors of the RanGTP-Importin-beta complex. PubChem Bioassay (2010)[AID] 
Target
Name:
Importin subunit alpha-1
Synonyms:
IMA1_HUMAN RCH1 karyopherin alpha 2 (RAG cohort 1, importin alpha 1), isoform CRA_b
Type:
Enzyme Catalytic Domain
Mol. Mass.:
57852.15
Organism:
Homo sapiens (Human)
Description:
gi_119609447
Residue:
529
  
Inhibitor
Name:
BDBM74700
Synonyms:
3-(4-Formyl-5-methyl-pyrazol-1-yl)-propionic acid 3-(4-formyl-5-methyl-pyrazol-1-yl)propionic acid 3-(4-methanoyl-5-methyl-pyrazol-1-yl)propanoic acid SMR000124015 | cid_719078
Type:
Small organic molecule
Emp. Form.:
C8H10N2O3
Mol. Mass.:
182.1766
SMILES:
Cc1c(C=O)cnn1CCC(O)=O
: