Target
Importin subunit alpha-1
Ligand
BDBM41489
Substrate
Meas. Tech.
Fluorescence Cell-Free Homogeneous Counterscreen to Identify Inhibitors of the RanGTP-Importin-beta complex.
EC50
>260000±n/a nM
Citation
 PubChem, PC Fluorescence Cell-Free Homogeneous Counterscreen to Identify Inhibitors of the RanGTP-Importin-beta complex. PubChem Bioassay (2010)[AID] 
Target
Name:
Importin subunit alpha-1
Synonyms:
IMA1_HUMAN RCH1 karyopherin alpha 2 (RAG cohort 1, importin alpha 1), isoform CRA_b
Type:
Enzyme Catalytic Domain
Mol. Mass.:
57852.15
Organism:
Homo sapiens (Human)
Description:
gi_119609447
Residue:
529
  
Inhibitor
Name:
BDBM41489
Synonyms:
(4Z)-2-(4-fluorophenyl)-4-[(2-methyl-1H-indol-3-yl)methylene]-2-oxazolin-5-one (4Z)-2-(4-fluorophenyl)-4-[(2-methyl-1H-indol-3-yl)methylidene]-5-oxazolone MLS000531355 cid_5646019
Type:
Small organic molecule
Emp. Form.:
C19H13FN2O2
Mol. Mass.:
320.3171
SMILES:
Cc1[nH]c2ccccc2c1\C=C1/N=C(OC1=O)c1ccc(F)cc1
: