Target
Tyrosine-protein phosphatase non-receptor type 22
Ligand
BDBM54768
Substrate
Meas. Tech.
Dose Response confirmation of uHTS hits from a small molecule inhibitors of LYP via a fluorescence intensity assay using pCAP substrate
IC50
5967±n/a nM
Citation
 PubChem, PC Dose Response confirmation of uHTS hits from a small molecule inhibitors of LYP via a fluorescence intensity assay using pCAP substrate PubChem Bioassay (2010)[AID] 
Target
Name:
Tyrosine-protein phosphatase non-receptor type 22
Synonyms:
3.1.3.48 LyP Lymphoid phosphatase (Lyp) PEST-domain phosphatase PTPN22 Tyrosine-protein phosphatase non-receptor type 22 (LYP) | tyrosine-protein phosphatase non-receptor type 22 isoform 1
Type:
Mol. Mass.:
91712.31
Organism:
Homo sapiens (Human)
Description:
Q9Y2R2
Residue:
807
  
Inhibitor
Name:
BDBM54768
Synonyms:
2-[3-[2-hydroxyethyl(dimethyl)ammonio]propanoylamino]-2-methyl-propane-1-sulfonate 2-[3-[2-hydroxyethyl(dimethyl)azaniumyl]propanoylamino]-2-methylpropane-1-sulfonate MLS000554255 US20230364057, Compound 42 | cid_1973720
Type:
Small organic molecule
Emp. Form.:
C11H24N2O5S
Mol. Mass.:
296.384
SMILES:
CC(C)(CS([O-])(=O)=O)NC(=O)CC[N+](C)(C)CCO
: