Target
Tyrosine-protein phosphatase non-receptor type 22
Ligand
BDBM74494
Substrate
Meas. Tech.
Dose Response confirmation of uHTS hits from a small molecule inhibitors of LYP via a fluorescence intensity assay using pCAP substrate
IC50
>79400±n/a nM
Citation
 PubChem, PC Dose Response confirmation of uHTS hits from a small molecule inhibitors of LYP via a fluorescence intensity assay using pCAP substrate PubChem Bioassay (2010)[AID] 
Target
Name:
Tyrosine-protein phosphatase non-receptor type 22
Synonyms:
3.1.3.48 LyP Lymphoid phosphatase (Lyp) PEST-domain phosphatase PTPN22 Tyrosine-protein phosphatase non-receptor type 22 (LYP) | tyrosine-protein phosphatase non-receptor type 22 isoform 1
Type:
Mol. Mass.:
91712.31
Organism:
Homo sapiens (Human)
Description:
Q9Y2R2
Residue:
807
  
Inhibitor
Name:
BDBM74494
Synonyms:
2-phenyl-5-(2-thienyl)pyrazole-3-carboxylic acid [2-keto-2-(4-methyl-3-nitro-anilino)ethyl] ester MLS000375423 [2-(4-methyl-3-nitroanilino)-2-oxoethyl] 2-phenyl-5-thiophen-2-ylpyrazole-3-carboxylate cid_2449636
Type:
Small organic molecule
Emp. Form.:
C23H18N4O5S
Mol. Mass.:
462.478
SMILES:
Cc1ccc(NC(=O)COC(=O)c2cc(nn2-c2ccccc2)-c2cccs2)cc1[N+]([O-])=O
: