Target
Tyrosine-protein phosphatase non-receptor type 22
Ligand
BDBM34905
Substrate
Meas. Tech.
Dose Response confirmation of uHTS hits from a small molecule inhibitors of LYP via a fluorescence intensity assay using pCAP substrate
IC50
1784±n/a nM
Citation
 PubChem, PC Dose Response confirmation of uHTS hits from a small molecule inhibitors of LYP via a fluorescence intensity assay using pCAP substrate PubChem Bioassay (2010)[AID] 
Target
Name:
Tyrosine-protein phosphatase non-receptor type 22
Synonyms:
3.1.3.48 LyP Lymphoid phosphatase (Lyp) PEST-domain phosphatase PTPN22 Tyrosine-protein phosphatase non-receptor type 22 (LYP) | tyrosine-protein phosphatase non-receptor type 22 isoform 1
Type:
Mol. Mass.:
91712.31
Organism:
Homo sapiens (Human)
Description:
Q9Y2R2
Residue:
807
  
Inhibitor
Name:
BDBM34905
Synonyms:
1,6-dimethyl-3-propyl-pyrimido[5,4-e][1,2,4]triazine-5,7-dione 1,6-dimethyl-3-propylpyrimido[5,4-e][1,2,4]triazine-5,7-dione SMR000291200 cid_3164059
Type:
Small organic molecule
Emp. Form.:
C10H13N5O2
Mol. Mass.:
235.2425
SMILES:
CCCc1nn(C)c2nc(=O)n(C)c(=O)c2n1
: