Target
Tyrosine-protein phosphatase non-receptor type 22
Ligand
BDBM74522
Substrate
Meas. Tech.
Dose Response confirmation of uHTS hits from a small molecule inhibitors of LYP via a fluorescence intensity assay using pCAP substrate
IC50
>79400±n/a nM
Citation
 PubChem, PC Dose Response confirmation of uHTS hits from a small molecule inhibitors of LYP via a fluorescence intensity assay using pCAP substrate PubChem Bioassay (2010)[AID] 
Target
Name:
Tyrosine-protein phosphatase non-receptor type 22
Synonyms:
3.1.3.48 LyP Lymphoid phosphatase (Lyp) PEST-domain phosphatase PTPN22 Tyrosine-protein phosphatase non-receptor type 22 (LYP) | tyrosine-protein phosphatase non-receptor type 22 isoform 1
Type:
Mol. Mass.:
91712.31
Organism:
Homo sapiens (Human)
Description:
Q9Y2R2
Residue:
807
  
Inhibitor
Name:
BDBM74522
Synonyms:
5-[1-[2-[(5-methyl-1H-pyrazol-3-yl)amino]-2-oxidanylidene-ethyl]-2,4-bis(oxidanylidene)quinazolin-3-yl]-N-[1-(phenylmethyl)piperidin-4-yl]pentanamide MLS000730449 N-(1-benzylpiperidin-4-yl)-5-[1-[2-[(5-methyl-1H-pyrazol-3-yl)amino]-2-oxoethyl]-2,4-dioxoquinazolin-3-yl]pentanamide SMR000308725 | cid_16195168
Type:
Small organic molecule
Emp. Form.:
C31H37N7O4
Mol. Mass.:
571.67
SMILES:
Cc1cc(NC(=O)Cn2c3ccccc3c(=O)n(CCCCC(=O)NC3CCN(Cc4ccccc4)CC3)c2=O)[nH]n1
: