Target
Tyrosine-protein phosphatase non-receptor type 22
Ligand
BDBM74542
Substrate
Meas. Tech.
Dose Response confirmation of uHTS hits from a small molecule inhibitors of LYP via a fluorescence intensity assay using pCAP substrate
IC50
>79400±n/a nM
Citation
 PubChem, PC Dose Response confirmation of uHTS hits from a small molecule inhibitors of LYP via a fluorescence intensity assay using pCAP substrate PubChem Bioassay (2010)[AID] 
Target
Name:
Tyrosine-protein phosphatase non-receptor type 22
Synonyms:
3.1.3.48 LyP Lymphoid phosphatase (Lyp) PEST-domain phosphatase PTPN22 Tyrosine-protein phosphatase non-receptor type 22 (LYP) | tyrosine-protein phosphatase non-receptor type 22 isoform 1
Type:
Mol. Mass.:
91712.31
Organism:
Homo sapiens (Human)
Description:
Q9Y2R2
Residue:
807
  
Inhibitor
Name:
BDBM74542
Synonyms:
MLS001140416 [4-(5-fluoro-1H-indole-2-carbonyl)piperazin-1-yl]-(furan-2-yl)methanone [4-[(5-fluoranyl-1H-indol-2-yl)carbonyl]piperazin-1-yl]-(furan-2-yl)methanone cid_4974197
Type:
Small organic molecule
Emp. Form.:
C18H16FN3O3
Mol. Mass.:
341.3363
SMILES:
Fc1ccc2[nH]c(cc2c1)C(=O)N1CCN(CC1)C(=O)c1ccco1
: