Target
Envelope glycoprotein gp160
Ligand
BDBM46236
Substrate
Meas. Tech.
SAR analysis of compounds that inhibit Human Immunodeficiency Virus Fusion, cell-cell fusion assay
IC50
5400±700 nM
Citation
 PubChem, PC SAR analysis of compounds that inhibit Human Immunodeficiency Virus Fusion, cell-cell fusion assay PubChem Bioassay (2010)[AID] 
Target
Name:
Envelope glycoprotein gp160
Synonyms:
envelope glycoprotein
Type:
Enzyme Catalytic Domain
Mol. Mass.:
91798.58
Organism:
Human immunodeficiency virus 1
Description:
gi_45357394
Residue:
814
  
Inhibitor
Name:
BDBM46236
Synonyms:
4-[8-[(3-chloranyl-2-methyl-phenyl)sulfamoyl]-3a,4,5,9b-tetrahydro-3H-cyclopenta[c]quinolin-4-yl]benzoic acid 4-[8-[(3-chloro-2-methylphenyl)sulfamoyl]-3a,4,5,9b-tetrahydro-3H-cyclopenta[c]quinolin-4-yl]benzoic acid cid_2975144
Type:
Small organic molecule
Emp. Form.:
C26H23ClN2O4S
Mol. Mass.:
494.99
SMILES:
Cc1c(Cl)cccc1NS(=O)(=O)c1ccc2NC(C3CC=CC3c2c1)c1ccc(cc1)C(O)=O
: