Target
Envelope glycoprotein gp160
Ligand
BDBM70239
Substrate
Meas. Tech.
SAR analysis of compounds that inhibit Human Immunodeficiency Virus Fusion, cell-cell fusion assay
IC50
4100±140 nM
Citation
 PubChem, PC SAR analysis of compounds that inhibit Human Immunodeficiency Virus Fusion, cell-cell fusion assay PubChem Bioassay (2010)[AID] 
Target
Name:
Envelope glycoprotein gp160
Synonyms:
envelope glycoprotein
Type:
Enzyme Catalytic Domain
Mol. Mass.:
91798.58
Organism:
Human immunodeficiency virus 1
Description:
gi_45357394
Residue:
814
  
Inhibitor
Name:
BDBM70239
Synonyms:
2-[[3-(4-chloranylphenoxy)phenyl]methyl-[(1S)-1,2,3,4-tetrahydronaphthalen-1-yl]carbamoyl]benzoic acid 2-[[3-(4-chlorophenoxy)phenyl]methyl-[(1S)-1,2,3,4-tetrahydronaphthalen-1-yl]carbamoyl]benzoic acid MLS-0435713.0001 | cid_45115622
Type:
Small organic molecule
Emp. Form.:
C31H26ClNO4
Mol. Mass.:
511.995
SMILES:
OC(=O)c1ccccc1C(=O)N(Cc1cccc(Oc2ccc(Cl)cc2)c1)[C@H]1CCCc2ccccc12
: