Target
Tyrosine-protein phosphatase non-receptor type 7
Ligand
BDBM37712
Substrate
Meas. Tech.
Dose Response confirmation of HTS hits from an HePTP Fluorescent Assay using OMFP substrate - Set 2
IC50
69263±3955 nM
Citation
 PubChem, PC Dose Response confirmation of HTS hits from an HePTP Fluorescent Assay using OMFP substrate - Set 2 PubChem Bioassay (2010)[AID] 
Target
Name:
Tyrosine-protein phosphatase non-receptor type 7
Synonyms:
He-PTP Hematopoietic protein-tyrosine phosphatase (HEPTP) PTPN7 Tyrosine-protein phosphatase non-receptor type 7 | Tyrosine-protein phosphatase non-receptor type 7 (HEPTP)
Type:
Protein
Mol. Mass.:
40530.79
Organism:
Homo sapiens (Human)
Description:
P35236
Residue:
360
  
Inhibitor
Name:
BDBM37712
Synonyms:
4-{[3-(1,4-dioxa-8-azaspiro[4.5]dec-8-yl)-6-oxo-6H-anthra[1,9-cd]isoxazol-5-yl]amino}butanoic acid SMR000021906 | cid_3239469
Type:
Small organic molecule
Emp. Form.:
C25H25N3O6
Mol. Mass.:
463.4825
SMILES:
OC(=O)CCCNc1cc(N2CCC3(CC2)OCCO3)c2noc3-c4ccccc4C(=O)c1c23
: