Target
Tyrosine-protein phosphatase non-receptor type 7
Ligand
BDBM34671
Substrate
Meas. Tech.
Dose Response confirmation of HTS hits from an HePTP Fluorescent Assay using OMFP substrate - Set 2
IC50
<1240±0 nM
Citation
 PubChem, PC Dose Response confirmation of HTS hits from an HePTP Fluorescent Assay using OMFP substrate - Set 2 PubChem Bioassay (2010)[AID] 
Target
Name:
Tyrosine-protein phosphatase non-receptor type 7
Synonyms:
He-PTP Hematopoietic protein-tyrosine phosphatase (HEPTP) PTPN7 Tyrosine-protein phosphatase non-receptor type 7 | Tyrosine-protein phosphatase non-receptor type 7 (HEPTP)
Type:
Protein
Mol. Mass.:
40530.79
Organism:
Homo sapiens (Human)
Description:
P35236
Residue:
360
  
Inhibitor
Name:
BDBM34671
Synonyms:
1,3,6-Trimethyl-1H-pyrimido[5,4-e][1,2,4]triazine-5,7-dione 1,3,6-trimethylpyrimido[5,4-e][1,2,4]triazine-5,7-quinone SMR000121073 cid_460747
Type:
Small organic molecule
Emp. Form.:
C8H9N5O2
Mol. Mass.:
207.1894
SMILES:
Cc1nn(C)c2nc(=O)n(C)c(=O)c2n1
: