Target
Tyrosine-protein phosphatase non-receptor type 7
Ligand
BDBM74501
Substrate
Meas. Tech.
Dose Response confirmation of HTS hits from an HePTP Fluorescent Assay using OMFP substrate - Set 2
IC50
>79400±0 nM
Citation
 PubChem, PC Dose Response confirmation of HTS hits from an HePTP Fluorescent Assay using OMFP substrate - Set 2 PubChem Bioassay (2010)[AID] 
Target
Name:
Tyrosine-protein phosphatase non-receptor type 7
Synonyms:
He-PTP Hematopoietic protein-tyrosine phosphatase (HEPTP) PTPN7 Tyrosine-protein phosphatase non-receptor type 7 | Tyrosine-protein phosphatase non-receptor type 7 (HEPTP)
Type:
Protein
Mol. Mass.:
40530.79
Organism:
Homo sapiens (Human)
Description:
P35236
Residue:
360
  
Inhibitor
Name:
BDBM74501
Synonyms:
2-({[5-(ethylsulfanyl)-1,3,4-thiadiazol-2-yl]amino}carbonyl)cyclohexanecarboxylic acid 2-[[5-(ethylthio)-1,3,4-thiadiazol-2-yl]carbamoyl]cyclohexanecarboxylic acid MLS000705542 cid_3275002
Type:
Small organic molecule
Emp. Form.:
C12H17N3O3S2
Mol. Mass.:
315.412
SMILES:
CCSc1nnc(NC(=O)C2CCCCC2C(O)=O)s1
: