Target
Tyrosine-protein phosphatase non-receptor type 7
Ligand
BDBM74536
Substrate
Meas. Tech.
Dose Response confirmation of HTS hits from an HePTP Fluorescent Assay using OMFP substrate - Set 2
IC50
>79400±0 nM
Citation
 PubChem, PC Dose Response confirmation of HTS hits from an HePTP Fluorescent Assay using OMFP substrate - Set 2 PubChem Bioassay (2010)[AID] 
Target
Name:
Tyrosine-protein phosphatase non-receptor type 7
Synonyms:
He-PTP Hematopoietic protein-tyrosine phosphatase (HEPTP) PTPN7 Tyrosine-protein phosphatase non-receptor type 7 | Tyrosine-protein phosphatase non-receptor type 7 (HEPTP)
Type:
Protein
Mol. Mass.:
40530.79
Organism:
Homo sapiens (Human)
Description:
P35236
Residue:
360
  
Inhibitor
Name:
BDBM74536
Synonyms:
2-[3-(3-fluoranyl-4-methyl-phenyl)-2,4-bis(oxidanylidene)thieno[3,2-d]pyrimidin-1-yl]-N-(oxolan-2-ylmethyl)ethanamide 2-[3-(3-fluoro-4-methylphenyl)-2,4-dioxo-1-thieno[3,2-d]pyrimidinyl]-N-(2-oxolanylmethyl)acetamide MLS000950328 cid_6621355
Type:
Small organic molecule
Emp. Form.:
C20H20FN3O4S
Mol. Mass.:
417.454
SMILES:
Cc1ccc(cc1F)-n1c(=O)n(CC(=O)NCC2CCCO2)c2ccsc2c1=O
: