Target
Tyrosine-protein phosphatase non-receptor type 22
Ligand
BDBM46217
Substrate
Meas. Tech.
SAR LYP1 Fluorescent Assay using OMFP substrate for In Vitro dose response studies - Set 3
IC50
77500±n/a nM
Citation
 PubChem, PC SAR LYP1 Fluorescent Assay using OMFP substrate for In Vitro dose response studies - Set 3 PubChem Bioassay (2010)[AID] 
Target
Name:
Tyrosine-protein phosphatase non-receptor type 22
Synonyms:
3.1.3.48 LyP Lymphoid phosphatase (Lyp) PEST-domain phosphatase PTPN22 Tyrosine-protein phosphatase non-receptor type 22 (LYP) | tyrosine-protein phosphatase non-receptor type 22 isoform 1
Type:
Mol. Mass.:
91712.31
Organism:
Homo sapiens (Human)
Description:
Q9Y2R2
Residue:
807
  
Inhibitor
Name:
BDBM46217
Synonyms:
2-(2-dibenzothiophenyloxy)-2-methylpropanoic acid 2-dibenzothiophen-2-yloxy-2-methyl-propionic acid MLS-0412044.0001 | cid_901652
Type:
Small organic molecule
Emp. Form.:
C16H14O3S
Mol. Mass.:
286.346
SMILES:
CC(C)(Oc1ccc2sc3ccccc3c2c1)C(O)=O
: