Target
Tyrosine-protein phosphatase non-receptor type 22
Ligand
BDBM46236
Substrate
Meas. Tech.
SAR LYP1 Fluorescent Assay using OMFP substrate for In Vitro dose response studies - Set 3
IC50
15800±n/a nM
Citation
 PubChem, PC SAR LYP1 Fluorescent Assay using OMFP substrate for In Vitro dose response studies - Set 3 PubChem Bioassay (2010)[AID] 
Target
Name:
Tyrosine-protein phosphatase non-receptor type 22
Synonyms:
3.1.3.48 LyP Lymphoid phosphatase (Lyp) PEST-domain phosphatase PTPN22 Tyrosine-protein phosphatase non-receptor type 22 (LYP) | tyrosine-protein phosphatase non-receptor type 22 isoform 1
Type:
Mol. Mass.:
91712.31
Organism:
Homo sapiens (Human)
Description:
Q9Y2R2
Residue:
807
  
Inhibitor
Name:
BDBM46236
Synonyms:
4-[8-[(3-chloranyl-2-methyl-phenyl)sulfamoyl]-3a,4,5,9b-tetrahydro-3H-cyclopenta[c]quinolin-4-yl]benzoic acid 4-[8-[(3-chloro-2-methylphenyl)sulfamoyl]-3a,4,5,9b-tetrahydro-3H-cyclopenta[c]quinolin-4-yl]benzoic acid cid_2975144
Type:
Small organic molecule
Emp. Form.:
C26H23ClN2O4S
Mol. Mass.:
494.99
SMILES:
Cc1c(Cl)cccc1NS(=O)(=O)c1ccc2NC(C3CC=CC3c2c1)c1ccc(cc1)C(O)=O
: