Target
Tyrosine-protein phosphatase non-receptor type 22
Ligand
BDBM46281
Substrate
Meas. Tech.
SAR LYP1 Fluorescent Assay using OMFP substrate for In Vitro dose response studies - Set 3
IC50
3490±n/a nM
Citation
 PubChem, PC SAR LYP1 Fluorescent Assay using OMFP substrate for In Vitro dose response studies - Set 3 PubChem Bioassay (2010)[AID] 
Target
Name:
Tyrosine-protein phosphatase non-receptor type 22
Synonyms:
3.1.3.48 LyP Lymphoid phosphatase (Lyp) PEST-domain phosphatase PTPN22 Tyrosine-protein phosphatase non-receptor type 22 (LYP) | tyrosine-protein phosphatase non-receptor type 22 isoform 1
Type:
Mol. Mass.:
91712.31
Organism:
Homo sapiens (Human)
Description:
Q9Y2R2
Residue:
807
  
Inhibitor
Name:
BDBM46281
Synonyms:
2-[4-[(Z)-[2-(4-fluoroanilino)-4-keto-2-thiazolin-5-ylidene]methyl]phenoxy]acetic acid methyl ester MLS-0425606.0001 methyl 2-[4-[(Z)-[2-(4-fluoroanilino)-4-oxo-1,3-thiazol-5-ylidene]methyl]phenoxy]acetate | methyl 2-[4-[(Z)-[2-[(4-fluorophenyl)amino]-4-oxidanylidene-1,3-thiazol-5-ylidene]methyl]phenoxy]ethanoate
Type:
Small organic molecule
Emp. Form.:
C19H15FN2O4S
Mol. Mass.:
386.397
SMILES:
COC(=O)COc1ccc(C=C2SC(Nc3ccc(F)cc3)=NC2=O)cc1
: