Target
Tyrosine-protein phosphatase non-receptor type 22
Ligand
BDBM61655
Substrate
Meas. Tech.
SAR LYP1 Fluorescent Assay using OMFP substrate for In Vitro dose response studies - Set 3
IC50
>100000±n/a nM
Citation
 PubChem, PC SAR LYP1 Fluorescent Assay using OMFP substrate for In Vitro dose response studies - Set 3 PubChem Bioassay (2010)[AID] 
Target
Name:
Tyrosine-protein phosphatase non-receptor type 22
Synonyms:
3.1.3.48 LyP Lymphoid phosphatase (Lyp) PEST-domain phosphatase PTPN22 Tyrosine-protein phosphatase non-receptor type 22 (LYP) | tyrosine-protein phosphatase non-receptor type 22 isoform 1
Type:
Mol. Mass.:
91712.31
Organism:
Homo sapiens (Human)
Description:
Q9Y2R2
Residue:
807
  
Inhibitor
Name:
BDBM61655
Synonyms:
4-[4-[(5Z)-4-keto-5-m-anisylidene-2-thioxo-thiazolidin-3-yl]butanoylamino]benzoic acid 4-[4-[(5Z)-5-[(3-methoxyphenyl)methylidene]-4-oxo-2-sulfanylidene-1,3-thiazolidin-3-yl]butanoylamino]benzoic acid MLS001201615 cid_6201879
Type:
Small organic molecule
Emp. Form.:
C22H20N2O5S2
Mol. Mass.:
456.535
SMILES:
COc1cccc(\C=C2/SC(=S)N(CCCC(=O)Nc3ccc(cc3)C(O)=O)C2=O)c1
: