Target
Tyrosine-protein phosphatase non-receptor type 22
Ligand
BDBM46220
Substrate
Meas. Tech.
SAR LYP1 Fluorescent Assay using pCAP substrate for In Vitro dose response studies - Set 3
IC50
>100000±n/a nM
Citation
 PubChem, PC SAR LYP1 Fluorescent Assay using pCAP substrate for In Vitro dose response studies - Set 3 PubChem Bioassay (2010)[AID] 
Target
Name:
Tyrosine-protein phosphatase non-receptor type 22
Synonyms:
3.1.3.48 LyP Lymphoid phosphatase (Lyp) PEST-domain phosphatase PTPN22 Tyrosine-protein phosphatase non-receptor type 22 (LYP) | tyrosine-protein phosphatase non-receptor type 22 isoform 1
Type:
Mol. Mass.:
91712.31
Organism:
Homo sapiens (Human)
Description:
Q9Y2R2
Residue:
807
  
Inhibitor
Name:
BDBM46220
Synonyms:
2-(3-methyl-4-methylsulfonyl-phenoxy)ethanoic acid 2-(4-mesyl-3-methyl-phenoxy)acetic acid cid_27161
Type:
Small organic molecule
Emp. Form.:
C10H12O5S
Mol. Mass.:
244.264
SMILES:
Cc1cc(OCC(O)=O)ccc1S(C)(=O)=O
: