Target
Dual specificity protein phosphatase 3
Ligand
BDBM75361
Substrate
Meas. Tech.
SAR analysis of compounds that inhibit VHR1, Fluorescent Assay - Set 2
IC50
37900±n/a nM
Citation
 PubChem, PC SAR analysis of compounds that inhibit VHR1, Fluorescent Assay - Set 2 PubChem Bioassay (2010)[AID] 
Target
Name:
Dual specificity protein phosphatase 3
Synonyms:
DUS3_HUMAN Dual specificity protein phosphatase (VHR) Dual specificity protein phosphatase VHR Tyrosine-protein phosphatase non-receptor type 1 | VHR
Type:
Hydrolase
Mol. Mass.:
20480.58
Organism:
Homo sapiens (Human)
Description:
Residue:
185
  
Inhibitor
Name:
BDBM75361
Synonyms:
4-amino-3-(2-fluoro-5-methyl-phenyl)-N-(p-tolyl)-2-thioxo-4-thiazoline-5-carboxamide 4-amino-3-(2-fluoro-5-methylphenyl)-N-(4-methylphenyl)-2-sulfanylidene-5-thiazolecarboxamide MLS-0237139.0001 | cid_4073188
Type:
Small organic molecule
Emp. Form.:
C18H16FN3OS2
Mol. Mass.:
373.468
SMILES:
Cc1ccc(NC(=O)c2sc(=S)n(c2N)-c2cc(C)ccc2F)cc1
: