Target
Dual specificity protein phosphatase 3
Ligand
BDBM75372
Substrate
Meas. Tech.
SAR analysis of compounds that inhibit VHR1, Fluorescent Assay - Set 2
IC50
>100000±n/a nM
Citation
 PubChem, PC SAR analysis of compounds that inhibit VHR1, Fluorescent Assay - Set 2 PubChem Bioassay (2010)[AID] 
Target
Name:
Dual specificity protein phosphatase 3
Synonyms:
DUS3_HUMAN Dual specificity protein phosphatase (VHR) Dual specificity protein phosphatase VHR Tyrosine-protein phosphatase non-receptor type 1 | VHR
Type:
Hydrolase
Mol. Mass.:
20480.58
Organism:
Homo sapiens (Human)
Description:
Residue:
185
  
Inhibitor
Name:
BDBM75372
Synonyms:
1-(3-methylphenyl)-3-(4-sulfamoylphenyl)thiourea MLS-0435637.0001 | cid_2470827
Type:
Small organic molecule
Emp. Form.:
C14H15N3O2S2
Mol. Mass.:
321.418
SMILES:
Cc1cccc(NC(=S)Nc2ccc(cc2)S(N)(=O)=O)c1
: