Target
Tyrosine-protein phosphatase non-receptor type 7
Ligand
BDBM46245
Substrate
Meas. Tech.
SAR analysis of compounds that inhibit HePTP - Set 2
IC50
2920±n/a nM
Citation
 PubChem, PC SAR analysis of compounds that inhibit HePTP - Set 2 PubChem Bioassay (2010)[AID] 
Target
Name:
Tyrosine-protein phosphatase non-receptor type 7
Synonyms:
He-PTP Hematopoietic protein-tyrosine phosphatase (HEPTP) PTPN7 Tyrosine-protein phosphatase non-receptor type 7 | Tyrosine-protein phosphatase non-receptor type 7 (HEPTP)
Type:
Protein
Mol. Mass.:
40530.79
Organism:
Homo sapiens (Human)
Description:
P35236
Residue:
360
  
Inhibitor
Name:
BDBM46245
Synonyms:
4-keto-5-methyl-2-[(E)-2-(4-methyl-3-nitro-phenyl)vinyl]-3H-thieno[2,3-d]pyrimidine-6-carboxylic acid 5-methyl-2-[(E)-2-(4-methyl-3-nitrophenyl)ethenyl]-4-oxo-3H-thieno[2,3-d]pyrimidine-6-carboxylic acid cid_8853383
Type:
Small organic molecule
Emp. Form.:
C17H13N3O5S
Mol. Mass.:
371.367
SMILES:
Cc1c(sc2nc(C=Cc3ccc(C)c(c3)[N+]([O-])=O)[nH]c(=O)c12)C(O)=O
: