Target
Tyrosine-protein phosphatase non-receptor type 7
Ligand
BDBM46272
Substrate
Meas. Tech.
SAR analysis of compounds that inhibit HePTP - Set 2
IC50
2330±n/a nM
Citation
 PubChem, PC SAR analysis of compounds that inhibit HePTP - Set 2 PubChem Bioassay (2010)[AID] 
Target
Name:
Tyrosine-protein phosphatase non-receptor type 7
Synonyms:
He-PTP Hematopoietic protein-tyrosine phosphatase (HEPTP) PTPN7 Tyrosine-protein phosphatase non-receptor type 7 | Tyrosine-protein phosphatase non-receptor type 7 (HEPTP)
Type:
Protein
Mol. Mass.:
40530.79
Organism:
Homo sapiens (Human)
Description:
P35236
Residue:
360
  
Inhibitor
Name:
BDBM46272
Synonyms:
2-[2-ethoxy-6-iodanyl-4-[(E)-(4-oxidanylidene-2-phenylazanyl-1,3-thiazol-5-ylidene)methyl]phenoxy]ethanoic acid 2-[4-[(E)-(2-anilino-4-oxo-1,3-thiazol-5-ylidene)methyl]-2-ethoxy-6-iodophenoxy]acetic acid MLS-0425587.0001 | cid_1756795
Type:
Small organic molecule
Emp. Form.:
C20H17IN2O5S
Mol. Mass.:
524.329
SMILES:
CCOc1cc(C=C2SC(Nc3ccccc3)=NC2=O)cc(I)c1OCC(O)=O
: