Target
Tyrosine-protein phosphatase non-receptor type 7
Ligand
BDBM75358
Substrate
Meas. Tech.
SAR analysis of compounds that inhibit HePTP - Set 2
IC50
100000±n/a nM
Citation
 PubChem, PC SAR analysis of compounds that inhibit HePTP - Set 2 PubChem Bioassay (2010)[AID] 
Target
Name:
Tyrosine-protein phosphatase non-receptor type 7
Synonyms:
He-PTP Hematopoietic protein-tyrosine phosphatase (HEPTP) PTPN7 Tyrosine-protein phosphatase non-receptor type 7 | Tyrosine-protein phosphatase non-receptor type 7 (HEPTP)
Type:
Protein
Mol. Mass.:
40530.79
Organism:
Homo sapiens (Human)
Description:
P35236
Residue:
360
  
Inhibitor
Name:
BDBM75358
Synonyms:
MLS-0435608.0001 [4-amino-3-(2,5-dimethylphenyl)-2-sulfanylidene-5-thiazolyl]-(1-piperidinyl)methanone [4-azanyl-3-(2,5-dimethylphenyl)-2-sulfanylidene-1,3-thiazol-5-yl]-piperidin-1-yl-methanone | cid_44620972
Type:
Small organic molecule
Emp. Form.:
C17H21N3OS2
Mol. Mass.:
347.498
SMILES:
Cc1ccc(C)c(c1)-n1c(N)c(sc1=S)C(=O)N1CCCCC1
: