Target
Kappa-type opioid receptor
Ligand
BDBM75408
Substrate
Meas. Tech.
SAR analysis of small molecule agonists of the kappa opioid receptor via a luminescent beta-arrestin assay - Set 3
EC50
>20000±n/a nM
Citation
 PubChem, PC SAR analysis of small molecule agonists of the kappa opioid receptor via a luminescent beta-arrestin assay - Set 3 PubChem Bioassay (2010)[AID] 
Target
Name:
Kappa-type opioid receptor
Synonyms:
K-OR-1 Kappa-opioid receptor (KOR) Kappa-type opioid receptor (KOR) OPIATE Kappa OPRK1 kappa opioid receptor (KOR)
Type:
G Protein-Coupled Receptor (GPCR)
Mol. Mass.:
42648.76
Organism:
Homo sapiens (Human)
Description:
P41145
Residue:
380
  
Inhibitor
Name:
BDBM75408
Synonyms:
KSC-10-205 N-butyl-N-[(6-chloranyl-2-oxidanylidene-1H-quinolin-3-yl)methyl]benzamide N-butyl-N-[(6-chloro-2-oxo-1H-quinolin-3-yl)methyl]benzamide | cid_45479185
Type:
Small organic molecule
Emp. Form.:
C21H21ClN2O2
Mol. Mass.:
368.857
SMILES:
CCCCN(Cc1cc2cc(Cl)ccc2[nH]c1=O)C(=O)c1ccccc1
: