Target
Kappa-type opioid receptor
Ligand
BDBM75411
Substrate
Meas. Tech.
SAR analysis of small molecule agonists of the kappa opioid receptor via a luminescent beta-arrestin assay - Set 3
EC50
>20000±n/a nM
Citation
 PubChem, PC SAR analysis of small molecule agonists of the kappa opioid receptor via a luminescent beta-arrestin assay - Set 3 PubChem Bioassay (2010)[AID] 
Target
Name:
Kappa-type opioid receptor
Synonyms:
K-OR-1 Kappa-opioid receptor (KOR) Kappa-type opioid receptor (KOR) OPIATE Kappa OPRK1 kappa opioid receptor (KOR)
Type:
G Protein-Coupled Receptor (GPCR)
Mol. Mass.:
42648.76
Organism:
Homo sapiens (Human)
Description:
P41145
Residue:
380
  
Inhibitor
Name:
BDBM75411
Synonyms:
2-[4-[(2-chlorophenyl)methyl]-5-(phenylmethylsulfanyl)-1,2,4-triazol-3-yl]pyridine 2-[5-(benzylthio)-4-(2-chlorobenzyl)-1,2,4-triazol-3-yl]pyridine KSC-12-171-A1 cid_45479173
Type:
Small organic molecule
Emp. Form.:
C21H17ClN4S
Mol. Mass.:
392.904
SMILES:
Clc1ccccc1Cn1c(SCc2ccccc2)nnc1-c1ccccn1
: